clamav update via custombuild fails

clamav update via custombuild fails

I have tried updating to clamav 0.97.5 via custombuild and it keeps failing. Similar but different errors each time. Here is what I am seeing. Any help would be appreciated:

Please submit a full bug report.
See <http://bugzilla.redhat.com/bugzilla> for instructions.
g++: Internal error: Killed (program cc1plus)
Please submit a full bug report.
See <http://bugzilla.redhat.com/bugzilla> for instructions.
g++: Internal error: Killed (program cc1plus)
Please submit a full bug report.
See <http://bugzilla.redhat.com/bugzilla> for instructions.
make[5]: *** [MachineBasicBlock.lo] Error 1
make[5]: *** Waiting for unfinished jobs….
make[5]: *** [MachineFunction.lo] Error 1
make[5]: *** [LiveVariables.lo] Error 1
make[5]: *** [MachineDominators.lo] Error 1
make[5]: *** [ValueTracking.lo] Error 1
make[5]: *** [libclamavcxx_la-bytecode2llvm.lo] Error 1
make[5]: *** [ELFWriter.lo] Error 1
make[5]: *** [ProfileInfo.lo] Error 1
make[5]: Leaving directory `/usr/local/directadmin/custombuild/clamav-0.97.5/libclamav/c++’
make[4]: *** [all] Error 2
make[4]: Leaving directory `/usr/local/directadmin/custombuild/clamav-0.97.5/libclamav/c++’
make[3]: *** [all-recursive] Error 1
make[3]: Leaving directory `/usr/local/directadmin/custombuild/clamav-0.97.5/libclamav’
make[2]: *** [all] Error 2
make[2]: Leaving directory `/usr/local/directadmin/custombuild/clamav-0.97.5/libclamav’
make[1]: *** [all-recursive] Error 1
make[1]: Leaving directory `/usr/local/directadmin/custombuild/clamav-0.97.5′
make: *** [all] Error 2

*** The make has failed, do you want to try to make again? (y,n):

g++: Internal error: Terminated (program cc1plus)
Please submit a full bug report.
See <http://bugzilla.redhat.com/bugzilla> for instructions.
make[5]: *** [ScalarEvolution.lo] Error 1
make[5]: *** Waiting for unfinished jobs….
make[5]: Leaving directory `/usr/local/directadmin/custombuild/clamav-0.97.5/libclamav/c++’
make[4]: *** [all] Error 2
make[4]: Leaving directory `/usr/local/directadmin/custombuild/clamav-0.97.5/libclamav/c++’
make[3]: *** [all-recursive] Error 1
make[3]: Leaving directory `/usr/local/directadmin/custombuild/clamav-0.97.5/libclamav’
make[2]: *** [all] Error 2
make[2]: Leaving directory `/usr/local/directadmin/custombuild/clamav-0.97.5/libclamav’
make[1]: *** [all-recursive] Error 1
make[1]: Leaving directory `/usr/local/directadmin/custombuild/clamav-0.97.5′
make: *** [all] Error 2

*** The make has failed, do you want to try to make again? (y,n):

Comments are closed.